{"text_format":"1","workbook":"xlsx","n_sheets":23,"sheets":["Group Information","Mid Mkt Enrollment Census IL","Mid Mkt Enrollment IL Mapping","Quoting Census Mapping","SG Enrollment Census Mapping","Source Census From The Group","DetermineSourceColumnAddr","Mid Market Quoting Census","Quoting Census Template","Mid Market Quoting Help File","Quoting Help File","Import Census Template","CensusVersionInfo","ErrData","ACA Help File","Mid Market Enrollment Census","Error List","Mid Mrkt Enrollment Help File","Mid Market Enrollment Help File","DC, OC, WP, PT & TERMED","LGDE Format","MM Enrollment Census Mapping","Census DDL"],"not_rendered":{"charts":0,"images":0,"macros":1,"external_links":0,"defined_names":68,"comments":0,"pivot_tables":0},"unopened":[],"bounds":{"document_bytes":16777216,"sheet_cells":100000,"rows_first":2000,"rows_last":500,"rows_between":2000,"halvings":0,"cell_chars":16384,"cell_head_chars":4096},"cells_cut":0,"cells_raw":0,"read":"whole","date_system":"1900"}

{"sheet":"Group Information","index":0,"n_rows":34,"n_cols":8,"rows_kept":34,"cut":false,"hidden":false,"merged":[[0,1,0,4],[25,2,25,4],[26,2,26,4],[33,2,36,4],[1,1,1,4],[27,2,27,4]]}
[null,"Smart Census Import Tool\nSetup Form"]
[]
[null,"Step 1: Please Make a Selection",null,null,"  ***  AHP Pilot R1  ***"]
[null,"Market Segment:","SMALL GROUP",{"$f":"IF(ISBLANK(C4),\"Required: Please select a value.\",IF(rMktSeg=\"SMALL GROUP\",\" (2-50)                                                                 \", \" (51-150)                                                            \"))","v":" (2-50)                                                                 "}]
[null,"Quoting or Enrollment:","QUOTING",{"$f":"IF(ISBLANK(C5),\"Required: Please select a value.\",\"\")","v":""},0]
[null,"Division:",null,{"$f":"IF(ISBLANK(C6),\"Required: Please select a value.\",\"\")","v":"Required: Please select a value."}]
{"$rows_left_out":29}
{"sheet":"Mid Mkt Enrollment Census IL","index":1,"n_rows":2,"n_cols":38,"rows_kept":2,"cut":false,"hidden":true,"merged":[]}
["Last Name *","Name Middle Initial","First Name *","SSN *","DOB * (mm/dd/yyyy)","Gender * (M or F)","Relationship   (SUB, SPS, DEP, STD, DIS)","Employee SSN\n(SYTEMATICALLY FILLED IF BLANK)","Hire Date* (mm/dd/yyyy)","Employee Status      (A, C, R, T, I,W)","Waiver Reason ","COBRA Reason","COBRA Start Date (mm/dd/yyyy)","COBRA  End Date (mm/dd/yyyy)","Street Line 1","Street Line 2 (Can't duplicate Address 1)","City","State","Zip ","Medicare Eligible  (N,Y)","Medicare  Part A  Effective Date (mm/dd/yyyy)","Medicare Part B Effective Date (mm/dd/yyyy)","Medicare Status  (P,S)","Medicare Reason  (AGED, DIS, ESRD)","Medicare HIC Number","Health Coverage ","Health Coverage Tier","Dental Coverage ","Dental Coverage Tier","WPHCP PCP Number","PCP Number","Medical Group Number","Life Coverage (Y/N)","Different Address for Spouse/Dependents? \nAuto Fills on File Save\nInformational Purpose","Billing Category","Product Category","Suffix","Dental HMO PCP Number"]
[null,null,null,null,null,null,"SUB"]

{"sheet":"Mid Mkt Enrollment IL Mapping","index":2,"n_rows":49,"n_cols":5,"rows_kept":49,"cut":false,"hidden":true,"merged":[]}
["Mid Market Enrollment \n Census Template Columns","Map Group's Source \nCensus Columns\n(Select from drop down list)","Source Census Column Letter\n(For Information Only)",null,"Mapping Source Columns to Census Template Columns"]
["Last Name *",null,{"$f":"IFERROR((VLOOKUP(B2,DetermineSourceColumnAddr!$A$2:$B$79,2)),\"\")","v":""},null,"Column A has column headers from the Census Template tab.\n        Helpful Hint: Click \"+/-\" to the left of row numbers to expand/collapse rows as needed."]
["Name Middle Initial",null,{"$f":"IFERROR((VLOOKUP(B3,DetermineSourceColumnAddr!$A$2:$B$79,2)),\"\")","v":""},null,"Column B has a drop down list with values which are column headers from the source file. \nColumn C is for informational purpose only"]
["First Name *",null,{"$f":"IFERROR((VLOOKUP(B4,DetermineSourceColumnAddr!$A$2:$B$79,2)),\"\")","v":""},null,"Steps for Mapping:"]
["SSN *",null,{"$f":"IFERROR((VLOOKUP(B5,DetermineSourceColumnAddr!$A$2:$B$79,2)),\"\")","v":""},null,"1) In Column B, select a value from the drop down list that corresponds to the value in Column A."]
["DOB * \n(mm/dd/yyyy)",null,{"$f":"IFERROR((VLOOKUP(B6,DetermineSourceColumnAddr!$A$2:$B$79,2)),\"\")","v":""},null,"      Note:  Census Template Columns with a drop down list are denoted by DDL . "]
{"$rows_left_out":44}
{"sheet":"Quoting Census Mapping","index":3,"n_rows":112,"n_cols":5,"rows_kept":112,"cut":false,"hidden":true,"merged":[]}
[" Small Group Quoting \nImport Census Template Columns","Map Group's Source \nCensus Columns\n(Select from drop down list)","Source Census Column Letter\n(For Information Only)",null,"Mapping Source Columns to Census Template Columns"]
["Last Name (Case Sensitive)",null,{"$f":"IFERROR((VLOOKUP(B2,DetermineSourceColumnAddr!$A$2:$B$79,2)),\"\")","v":""},null,"Column A has column headers from the Census Template tab."]
["First Name\n(Case Sensitive)",null,{"$f":"IFERROR((VLOOKUP(B3,DetermineSourceColumnAddr!$A$2:$B$79,2)),\"\")","v":""},null,"Column B has a drop down list with values which are column headers from the source file. \nColumn C is for informational purpose only."]
["Relationship Code DDL",null,{"$f":"IFERROR((VLOOKUP(B4,DetermineSourceColumnAddr!$A$2:$B$79,2)),\"\")","v":""},null,"Steps for Mapping:"]
["Gender (M or F) DDL",null,{"$f":"IFERROR((VLOOKUP(B5,DetermineSourceColumnAddr!$A$2:$B$79,2)),\"\")","v":""},null,"1) In Column B, select a value from the drop down list that corresponds to the value in Column A."]
["DOB (mm/dd/yyyy)",null,{"$f":"IFERROR((VLOOKUP(B6,DetermineSourceColumnAddr!$A$2:$B$79,2)),\"\")","v":""},null,"      Note:  Census Template Columns with a drop down list are denoted by DDL ."]
{"$rows_left_out":107}
{"sheet":"SG Enrollment Census Mapping","index":4,"n_rows":68,"n_cols":5,"rows_kept":68,"cut":false,"hidden":true,"merged":[]}
["ACA Small Group Enrollment \nImport Census Template Columns","Map Group's Source \nCensus Columns\n(Select from drop down list)","Source Census Column Letter\n(For Information Only)",null,"Mapping Source Columns to Import Census Template Columns"]
["Group Information Columns"]
["Relationship Code DDL",null,{"$f":"IFERROR((VLOOKUP(B3,DetermineSourceColumnAddr!$A$2:$B$79,2)),\"\")","v":""},null,"Column A has column headers from the Import Census Template.\n        Helpful Hint: Click \"+/-\" to the left of row numbers to expand/collapse rows as needed."]
["Waive All Coverage DDL",null,{"$f":"IFERROR((VLOOKUP(B4,DetermineSourceColumnAddr!$A$2:$B$79,2)),\"\")","v":""},null,"Column B has a drop down list with values which are column headers from the source file. \nColumn C is for informational purpose only."]
["Waive Reason Code DDL",null,{"$f":"IFERROR((VLOOKUP(B5,DetermineSourceColumnAddr!$A$2:$B$79,2)),\"\")","v":""},null,"Steps for Mapping:"]
["First Name",null,{"$f":"IFERROR((VLOOKUP(B6,DetermineSourceColumnAddr!$A$2:$B$79,2)),\"\")","v":""},null,"1) In Column B, select a value from the drop down list that corresponds to the value in Column A."]
{"$rows_left_out":63}
{"sheet":"Source Census From The Group","index":5,"n_rows":0,"n_cols":0,"rows_kept":0,"cut":false,"hidden":true,"merged":[]}

{"sheet":"DetermineSourceColumnAddr","index":6,"n_rows":79,"n_cols":6,"rows_kept":79,"cut":false,"hidden":true,"merged":[]}
["External Column Names","External Column Addresses","Column Letters","Green Button Cntr","Floater1 cntr","Floater2 cntr"]
["Actively emp characteristic (Y/N)","Q","A",1,1,1]
["Category  (Usually for billing - specify only Active or Cobra and with  \"billing catagories\" if warrented )","R","B"]
["Category Product - Wait Period  (Used if there are multi wait periods)","S","C"]
["City","N","D"]
["COBRA Reason   (DV,ET,RT,BS,DS,JT,LO,LS,ME,RH,SS)","H","E"]
{"$rows_left_out":74}
{"sheet":"Mid Market Quoting Census","index":7,"n_rows":2,"n_cols":12,"rows_kept":2,"cut":false,"hidden":true,"merged":[]}
["Last Name (Case Sensitive)","First Name (Case Sensitive)","Relationship Code","DOB (mm/dd/yyyy)","Age (in Years)","Gender (M or F)","Coverage Type (follow Help file instructions)","State (e.g. IL)","Annual Salary","Zip Code (only 5 digits)","Medicare Primary (Y, N, U)","Employment Status (e.g.A,C,R,T)"]
[null,null,"Employee"]

{"sheet":"Quoting Census Template","index":8,"n_rows":2,"n_cols":11,"rows_kept":2,"cut":false,"hidden":true,"merged":[]}
["Last Name (Case Sensitive)","First Name\n(Case Sensitive)","Relationship Code\n(follow Help file instructions)","Gender (M or F)","DOB (mm/dd/yyyy)","Coverage Type\n(follow Help file instructions)","State Code","Retiree (IL Only)","Annual Salary","Life Class","Zip Code (BBF Only)"]
[null,null,"Employee"]

{"sheet":"Mid Market Quoting Help File","index":9,"n_rows":34,"n_cols":5,"rows_kept":34,"cut":false,"hidden":true,"merged":[[6,1,6,4],[1,1,1,4],[2,1,2,4],[3,1,3,4],[4,1,4,4],[5,1,5,4],[19,1,28,1],[19,3,28,3],[19,4,28,4],[7,1,7,4],[8,1,8,4],[12,1,15,1],[12,3,15,3],[12,4,15,4]]}
[]
[null,"Use these rules to create the Import Census File:"]
[null,"1. Row 1 should not be deleted or changed. "]
[null,"2. Do NOT Delete any column in Census Import tab."]
[null,"3. Do NOT Change the order of the fields."]
[null,"4. Create a row for each census entry, containing these fields entered in this sequence"]
{"$rows_left_out":29}
{"sheet":"Quoting Help File","index":10,"n_rows":35,"n_cols":5,"rows_kept":35,"cut":false,"hidden":true,"merged":[[20,1,29,1],[20,3,29,3],[20,4,29,4],[1,1,1,4],[2,1,2,4],[3,1,3,4],[4,1,4,4],[5,1,5,4],[10,1,10,4],[14,1,17,1],[14,3,17,3],[14,4,17,4],[6,1,6,4],[7,1,7,4],[8,1,8,4],[9,1,9,4]]}
[]
[null,"Use these rules to create the Import Census File:"]
[null,"1. Row 1 should not be deleted or changed. "]
[null,"2. Do NOT Delete any column in Census Import tab."]
[null,"3. Do NOT Change the order of the fields."]
[null,"4. Create a row for each census entry, containing these fields entered in this sequence"]
{"$rows_left_out":30}
{"sheet":"Import Census Template","index":11,"n_rows":3,"n_cols":63,"rows_kept":3,"cut":false,"hidden":true,"merged":[]}
["General Information",null,null,null,null,null,null,null,null,null,null,null,null,null,null,null,null,null,null,null,null,null,null,"If Emp Status is COBRA",null,null,"If Emp Status is IL Cont",null,null,"Health Coverage",null,null,"If Waiving Health Coverage",null,"If HMO Plan is selected",null,null,null,null,null,null,null,"Dental Coverage",null,"",null,null,"Life Coverage",null,null,null,null,null,null,"Medicare ","Information"]
["Relationship Code","Waive All Coverage","Waive Reason Code","First Name","Mid Init","Last Name","Name Suffix","Date Of Birth","Gender","SSN","Address 1","Address 2","City","State","Zip Code","Home/Cell Phone","Business Phone","Email Address","Marital Status","Employment Status","Job Title","Hire Date","Hrs/Week","COBRA Reason Code","COBRA Start Date","COBRA Projected End Date","IL Cont Reason Code","IL Cont Start Date","IL Cont Projected End Date","Health Coverage (Y/N)","Health Coverage Type","Selected Health Plan","Health Waive Reason Code","Health Waive Description","Medical Group/IPA #","Medical Group/IPA Name","PCP #","PCP Name","PCP NPI #","WPHCP #","WPHCP Name","WPHCP NPI #","Dental Coverage (Y/N)","Dental Coverage Type","Selected Dental Plan","Dental Waive Reason Code","Dental Waive Description","Life Coverage (Y/N)","Job Class Type (2-9 -  Max 3 Life Classes &\n10+  Max 6 Life Classes)","Term Life","Dependent Life","Short Term Disability (STD)","Salary","Salary Period","Medicare Eligible","Medicare HIC Number","Medicare Reason","Medicare Primary or Secondary","Plan A Start Date","Plan A End Date","Plan B Start Date","Plan B End Date","Signature Date"]
["Employee"]

{"sheet":"CensusVersionInfo","index":12,"n_rows":5,"n_cols":2,"rows_kept":5,"cut":false,"hidden":true,"merged":[]}
["Config Item","Config Value"]
["Census Version","1.0"]
["Division",{"$f":"IF(rDiv=\"IL\",\"Illinois\",(IF(rDiv=\"TX\",\"Texas\",(IF(rDiv=\"OK\",\"Oklahoma\",IF(rDiv=\"NM\",\"New Mexico\",IF(rDiv=\"MT\",\"Montana\",\"\")))))))","v":""}]
["Ready To Upload","Y"]
["Debug","Y"]

{"sheet":"ErrData","index":13,"n_rows":1,"n_cols":2,"rows_kept":1,"cut":false,"hidden":true,"merged":[]}
[null,2]

{"sheet":"ACA Help File","index":14,"n_rows":80,"n_cols":5,"rows_kept":80,"cut":false,"hidden":true,"merged":[[6,1,6,4],[2,1,2,4],[3,1,3,4],[4,1,4,4],[5,1,5,4],[85,1,85,3],[7,1,7,4],[8,1,8,4],[9,1,9,4],[11,1,17,1],[11,3,17,3],[11,4,17,4],[80,1,80,4],[81,1,81,4],[82,1,82,3],[83,1,83,3],[84,1,84,3],[97,1,97,3],[86,1,86,3],[87,1,87,3],[88,1,88,3],[89,1,89,3],[90,1,90,3],[91,1,91,3],[92,1,92,3],[93,1,93,3],[94,1,94,4],[95,1,95,4],[96,1,96,4],[109,1,109,3],[98,1,98,3],[99,1,99,3],[100,1,100,4],[101,1,101,3],[102,1,102,3],[103,1,103,3],[104,1,104,4],[105,1,105,3],[106,1,106,3],[107,1,107,3],[108,1,108,3],[121,1,121,3],[110,1,110,3],[111,1,111,3],[112,1,112,3],[113,1,113,3],[114,1,114,3],[115,1,115,3],[116,1,116,3],[117,1,117,3],[118,1,118,3],[119,1,119,3],[120,1,120,3],[134,1,134,3],[122,1,122,3],[123,1,123,3],[124,1,124,3],[125,1,125,3],[126,1,126,3],[127,1,127,3],[128,1,128,3],[129,1,129,3],[130,1,130,3],[132,1,132,3],[133,1,133,4]]}
[]
[]
[null,"Importing Census Entries:"]
[null,"Creating the Import Census File:"]
[null,"Use these rules to create an Import census file."]
[null,"1. Row 1 should not be deleted or changed. "]
{"$rows_left_out":75}
{"sheet":"Mid Market Enrollment Census","index":15,"n_rows":3,"n_cols":46,"rows_kept":3,"cut":false,"hidden":true,"merged":[[0,3,0,4],[0,8,0,9]]}
["\n\n"]
["Last Name ","First Name ","Name Middle Initial","SSN (NO HYPHENS!!!)","DOB  (mm/dd/yyyy)","Gender (M or F)","Hire Date  (mm/dd/yyyy)","COBRA Reason","Cobra start date (mm/dd/yyyy)","E-Mail","Employee Status (A, C, R)","Street Line 1","Street Line 2 (Can't duplicate Address 1)","City","State","Zip     (5+4)","Actively emp characteristic (Y/N)","Category  (Usually for billing - specify only Active or Cobra and with  \"billing catagories\" if warrented )","Category Product - Wait Period  (Used if there are multi wait periods)","Relationship   (SUB, SPS,  DEP, STD, DP)","Employee SSN  (NO HYPHENS!!!)","Health Coverage (Chosen plans if more then one - fill all spaces if applicable)","Health Coverage Tier (fill all spaces)","Dental Coverage ","Dental Coverage Tier","Name Prefix","Name Suffix","PCP Number","Medical Group Number","Medicare Eligible  (N,Y)","Medicare  Part A  Effective Date (mm/dd/yyyy)","Medicare Part B Effective Date (mm/dd/yyyy)","Medicare Status  (P,S)","Medicare Reason  (AGED, DIS, ESRD)","Medicare HIC Number","Other Insurance  (N, U, Y)","Other Insurance Carrier Name","Other Insurance  Health","Other Insurance  Dental","Other Insurance  Hearing","Other Insurance  Vision","HIPAA-COCC supplied","HIPAA eff Date","HIPAA end date","HIPAA COCC applied","Other Insurance Effective Date"]
[null,null,null,null,null,null,null,null,null,null,null,null,null,null,null,null,null,null,null,"SUB"]

{"sheet":"Error List","index":16,"n_rows":0,"n_cols":0,"rows_kept":0,"cut":false,"hidden":true,"merged":[]}

{"sheet":"Mid Mrkt Enrollment Help File","index":17,"n_rows":158,"n_cols":5,"rows_kept":158,"cut":false,"hidden":true,"merged":[[2,1,2,4],[3,1,3,4],[4,1,4,4],[57,1,57,3],[8,1,8,4],[9,1,9,4],[5,1,5,4],[6,1,6,4],[7,1,7,4],[61,1,61,4],[62,1,62,3],[63,1,63,3],[58,1,58,3],[59,1,59,4],[60,1,60,4],[67,1,67,3],[68,1,68,3],[69,1,69,4],[64,1,64,3],[65,1,65,4],[66,1,66,3],[73,1,73,3],[74,1,74,3],[75,1,75,3],[70,1,70,3],[71,1,71,3],[72,1,72,3],[79,1,79,3],[80,1,80,3],[81,1,81,3],[76,1,76,3],[77,1,77,3],[78,1,78,3],[85,1,85,3],[86,1,86,3],[87,1,87,3],[82,1,82,3],[83,1,83,3],[84,1,84,3],[91,1,91,3],[92,1,92,3],[93,1,93,3],[88,1,88,3],[89,1,89,3],[90,1,90,3],[98,1,98,4],[99,1,99,3],[103,1,103,4],[104,1,104,4],[94,1,94,3],[95,1,95,3],[97,1,97,3],[108,1,108,4],[109,1,109,4],[110,1,110,4],[111,1,111,4],[105,1,105,4],[106,1,106,4],[107,1,107,4]]}
[]
[]
[null,"Mid Market Enrollment Census"]
[]
[null,"Please note:"]
[null,"1. Row 1 should always be a Subscriber/Employee. "]
{"$rows_left_out":153}
{"sheet":"Mid Market Enrollment Help File","index":18,"n_rows":155,"n_cols":31,"rows_kept":155,"cut":false,"hidden":true,"merged":[[105,1,105,4],[105,27,105,30],[106,1,106,4],[106,27,106,30],[108,1,108,4],[108,27,108,30],[107,1,107,4],[100,1,100,4],[100,27,100,30],[101,1,101,4],[101,27,101,30],[102,1,102,4],[102,27,102,30],[103,1,103,4],[103,27,103,30],[104,1,104,4],[104,27,104,30],[91,1,91,3],[92,1,92,3],[94,1,94,3],[95,1,95,4],[96,1,96,3],[90,1,90,3],[79,1,79,3],[80,1,80,3],[81,1,81,3],[82,1,82,3],[83,1,83,3],[84,1,84,3],[85,1,85,3],[86,1,86,3],[87,1,87,3],[88,1,88,3],[89,1,89,3],[78,1,78,3],[67,1,67,3],[68,1,68,3],[69,1,69,3],[70,1,70,3],[71,1,71,3],[72,1,72,3],[73,1,73,3],[74,1,74,3],[75,1,75,3],[76,1,76,3],[77,1,77,3],[66,1,66,4],[55,1,55,3],[56,1,56,4],[57,1,57,4],[58,1,58,4],[59,1,59,3],[60,1,60,3],[61,1,61,3],[62,1,62,4],[63,1,63,3],[64,1,64,3],[65,1,65,3],[7,27,7,30],[8,27,8,30],[9,27,9,30],[2,27,2,30],[3,27,3,30],[4,27,4,30],[5,27,5,30],[6,27,6,30],[54,1,54,3],[49,1,49,3],[50,1,50,3],[51,1,51,3],[52,1,52,3],[53,1,53,3],[2,1,2,4],[3,1,3,4],[4,1,4,4],[5,1,5,4],[6,1,6,4],[7,1,7,4],[8,1,8,4],[9,1,9,4],[49,27,49,29],[50,27,50,29],[51,27,51,29],[57,27,57,29],[58,27,58,29],[59,27,59,29],[60,27,60,30],[61,27,61,29],[52,27,52,29],[53,27,53,29],[54,27,54,30],[55,27,55,30],[56,27,56,30],[67,27,67,29],[68,27,68,29],[69,27,69,29],[70,27,70,29],[71,27,71,29],[62,27,62,29],[63,27,63,29],[64,27,64,30],[65,27,65,29],[66,27,66,29],[77,27,77,29],[78,27,78,29],[79,27,79,29],[80,27,80,29],[81,27,81,29],[72,27,72,29],[73,27,73,29],[74,27,74,29],[75,27,75,29],[76,27,76,29],[93,27,93,30],[94,27,94,29],[87,27,87,29],[88,27,88,29],[89,27,89,29],[90,27,90,29],[92,27,92,29],[82,27,82,29],[83,27,83,29],[84,27,84,29],[85,27,85,29],[86,27,86,29]]}
[]
[]
[null,"Mid Market Enrollment Census: Illinois",null,null,null,null,null,null,null,null,null,null,null,null,null,null,null,null,null,null,null,null,null,null,null,null,null,"Importing Census Entries:"]
[null,null,null,null,null,null,null,null,null,null,null,null,null,null,null,null,null,null,null,null,null,null,null,null,null,null,null,"Creating the Import Census File:"]
[null,"Please note:",null,null,null,null,null,null,null,null,null,null,null,null,null,null,null,null,null,null,null,null,null,null,null,null,null,"Use these rules to create an Import census file."]
[null,"1. Row 1 should always be a Subscriber/Employee. ",null,null,null,null,null,null,null,null,null,null,null,null,null,null,null,null,null,null,null,null,null,null,null,null,null,"1. Row 1 should not be deleted or changed. "]
{"$rows_left_out":150}
{"sheet":"DC, OC, WP, PT & TERMED","index":19,"n_rows":2,"n_cols":3,"rows_kept":2,"cut":false,"hidden":true,"merged":[[0,0,0,3]]}
["Enter employee's name below with their decision only:  Waiting Period (WP), Declined (DC), Other Coverage (OC).   If they were on the originally quoted census and have TERM'D or are Part-time (PT), they need to go here as well."]
["Last Name","First Name","Decision"]

{"sheet":"LGDE Format","index":20,"n_rows":2,"n_cols":33,"rows_kept":2,"cut":false,"hidden":true,"merged":[]}
["Last Name","First Name ","SSN\n (NO HYPHENS!)","DOB  (mm/dd/yyyy)","Gender (M or F)","Hire Date  (mm/dd/yyyy)","Employee Status","Cobra Start Date (mm/dd/yyyy)","COBRA Reason","Address 1","Address 2 \n(Can't duplicate Address 1)","City","State","Zip  Code","Category Product - Wait Period","Category  Billing\n(For Active or Cobra and with  billing catagories)","Name Middle Initial","Relationship","Employee SSN  (NO HYPHENS!!!)","Medicare Eligible  (N,Y)","Medicare  Part A  Effective Date (mm/dd/yyyy)","Medicare Part B Effective Date (mm/dd/yyyy)","Medicare Status  (P,S)","Medicare Reason  (AGED, DIS, ESRD)","Medicare HIC Number","Health Coverage","Health Coverage Tier","Dental Coverage ","Dental Coverage Tier","Medical Group Number","PCP Number","CMSESC","Actively Employed Characteristic \n(Y/N)"]
[null,null,null,null,null,null,null,null,null,null,null,null,null,null,null,null,null,"SUB"]

{"sheet":"MM Enrollment Census Mapping","index":21,"n_rows":33,"n_cols":5,"rows_kept":33,"cut":false,"hidden":true,"merged":[]}
["Mid Market Enrollment \nImport Census Template Columns","Map Group's Source \nCensus Columns\n(Select from drop down list)","Source Census Column Letter\n(For Information Only)",null,"Mapping Source Columns to Import Census Template Columns"]
["Last Name",null,{"$f":"IFERROR((VLOOKUP(B2,DetermineSourceColumnAddr!$A$2:$B$79,2)),\"\")","v":""},null,"Column A has column headers from the Census Template.\n        Helpful Hint: Click \"+/-\" to the left of row numbers to expand/collapse rows as needed."]
["First Name ",null,{"$f":"IFERROR((VLOOKUP(B3,DetermineSourceColumnAddr!$A$2:$B$79,2)),\"\")","v":""},null,"Column B has a drop down list with values which are column headers from the source file. \nColumn C is for informational purpose only"]
["Name Middle Initial",null,{"$f":"IFERROR((VLOOKUP(B4,DetermineSourceColumnAddr!$A$2:$B$79,2)),\"\")","v":""},null,"Steps for Mapping:"]
["SSN\n (NO HYPHENS!)",null,{"$f":"IFERROR((VLOOKUP(B5,DetermineSourceColumnAddr!$A$2:$B$79,2)),\"\")","v":""},null,"1) In Column B, select a value from the drop down list that corresponds to the value in Column A."]
["DOB  (mm/dd/yyyy)",null,{"$f":"IFERROR((VLOOKUP(B6,DetermineSourceColumnAddr!$A$2:$B$79,2)),\"\")","v":""},null,"      Note:  Census Template Columns with a drop down list are denoted by DDL . "]
{"$rows_left_out":28}
{"sheet":"Census DDL","index":22,"n_rows":84,"n_cols":40,"rows_kept":84,"cut":false,"hidden":true,"merged":[]}
["ListYesNo","ListRelationCodeIL","ListRelationCodeSW","ListWaiveReasonCode","ListGender","ListMaritalStatusIL","ListMaritalStatusSW","ListEmployStatusIL","ListEmployStatusTX","ListEmployStatusOKNMMT","ListCobraReasonCode","ListILContReasonCode","ListHlthCoverageTypeActive","ListHlthCoverageTypeCOBRA","ListSalaryPeriod","ListMedicareElig","ListMedicareReason","ListMedicarePS","ListAddrStates","ListFullState","ListLettersOnly","ListNbrsOnly","ccSpouseRows","ccRelationEO","ListQuoteEnroll","ListQuoteRelationCode","ListQuoteCoverageType","ListMMQuoteRC","ListMMQuoteCT","ListMMQuoteCTOK","ListMMQuoteIL","ListMMEmployStatus","ListMMERelationCode","ListMMERelationCodeIL","ListMMECobraReasonIL","ListMMECobraReasonCode","ListMMEEmployStatusIL","ListMMEEmployStatusSW","ListMMECovType","ListMMEWavierReasonIL"]
["Y","Employee","Employee","Waiving - Has other coverage","F","Single","Single","Active","Active","Active","Bankruptcy/Surviving Spouse","Dependent","EO","CO","Annual","Y","Aged","Primary","IL","Illinois","~","~","Spouse","Spouse","Quoting","Employee","EO","E","EO","EO","Emp","A","SUB","SUB","AS","DV","A","A","EO","Spouse/Domestic Partner's Employer Plan"]
["N","Spouse","Spouse","Waiving - No other coverage","M","Married","Married","Retired","Retired","Retired","Chapter 11 Bankruptcy","Employee","ES","CS","Hourly","N","Disabled","Secondary","TX","Texas","!","!","Domestic Partner","Domestic Partner","Enrollment","Spouse","ES","S","ES","ES","Emp+Sp","C","SPS","SPS","DV","ET","C","C","ES","Individual Coverage (Non-Group Plan)"]
[null,"Domestic Partner","Domestic Partner",null,null,"Divorced","Divorced","COBRA","COBRA","COBRA","Divorce","Spouse","EC","CC","Monthly","U","End Stage Renal Disease",null,"OK","Oklahoma","@","@","Civil Union","Dependent Child",null,"Dependent","EC","D","EC","EC","Emp+Ch","R","DEP","DEP","ET","RT","R","R","EC","Cobra/State Continuation"]
[null,"Dependent Child","Dependent Child",null,null,"Widowed","Widowed","IL Cont","Ineligible","Ineligible","Employee Death","Spouse and Dependent","EF","CF","Semi-Monthly",null,null,null,"NM","New Mexico","#","#",null,"Disabled Dependent",null,null,"EF",null,"EF","EF","Family","T","STD","DIS","RH","BS","T",null,"EF","Medicare or other Government Program"]
[null,"Disabled Dependent","Disabled Dependent",null,null,"Domestic Partner","Domestic Partner",null,"TX Cont",null,"Employee's Medicare Entitlement",null,"DC","DC","Weekly",null,null,null,"MT","Montana","$","$",null,"Civil Union",null,null,"CO",null,"CO","CO",null,null,"DIS","DP","RT","DS","I",null,null,"Other Parent Coverage"]
{"$rows_left_out":78}